{"text_format":"1","workbook":"xlsx","n_sheets":9,"sheets":["ようこそ","ランキング","所要時間","家賃相場","配点根拠","全データ","点数","参考順位","Sheet2"],"not_rendered":{"charts":0,"images":0,"macros":1,"external_links":0,"defined_names":8,"comments":0,"pivot_tables":0},"unopened":[],"bounds":{"document_bytes":16777216,"sheet_cells":100000,"rows_first":2000,"rows_last":500,"rows_between":2000,"halvings":0,"cell_chars":16384,"cell_head_chars":4096},"cells_cut":0,"cells_raw":0,"read":"whole","date_system":"1900"}

{"sheet":"ようこそ","index":0,"n_rows":7,"n_cols":8,"rows_kept":7,"cut":false,"hidden":false,"merged":[[2,5,2,6],[2,1,2,2]]}
[]
[null,"黄色セル部分をプルダウンより選択してください。"]
[null,"属性選択",null,null,null,"傾斜配点"]
[null,"到着駅","東京駅",{"$f":"IF(C4=\"東京駅\",2,3)","v":2},null,"所要時間","±0%",{"$f":"VLOOKUP($G4,配点根拠!$AB$3:$AC$23,2,0)","v":1}]
[null,"部屋タイプ","1K",{"$f":"IF(C5=\"1K\",5,6)","v":5},null,"通勤の快適性","±0%",{"$f":"VLOOKUP($G5,配点根拠!$AB$3:$AC$23,2,0)","v":1}]
[null,null,null,null,null,"家賃相場","±0%",{"$f":"VLOOKUP($G6,配点根拠!$AB$3:$AC$23,2,0)","v":1}]
[null,null,null,null,null,"商業施設充実度","±0%",{"$f":"VLOOKUP($G7,配点根拠!$AB$3:$AC$23,2,0)","v":1}]

{"sheet":"ランキング","index":1,"n_rows":96,"n_cols":17,"rows_kept":96,"cut":false,"hidden":false,"merged":[[1,5,1,6],[1,8,1,9]]}
[null,null,null,null,1,2,3,4,5,6,7,8,9,10,11,12,12]
[null,null,null,null,null,"所要時間点数",null,null,"家賃点数"]
[0,"道路名","IC名","鉄道路線","駅名","東京","新宿","快適性点数","1K","2LDK","商業施設","所要時間","快適性","家賃","商業施設","総合点","総合点（百点換算）"]
[{"$f":"A3+1","v":1},"東京湾アクアライン","木更津金田","高速バス","木更津金田BT",32.699999999999989,6.5999999999999943,100,99,100,100,{"$f":"VLOOKUP($E4,$E:$K,ようこそ!$D$4,0)","v":32.699999999999989},{"$f":"VLOOKUP($E4,$E:$K,ランキング!$H$1,0)","v":100},{"$f":"VLOOKUP($E4,$E:$K,ようこそ!$D$5,0)","v":99},{"$f":"VLOOKUP($E4,$E:$K,ランキング!$K$1,0)","v":100},{"$f":"VLOOKUP($E4,$E:$K,ようこそ!$D$4,0)*ようこそ!$H$4+VLOOKUP($E4,$E:$K,ランキング!$H$1,0)*ようこそ!$H$5+VLOOKUP($E4,$E:$K,ようこそ!$D$5,0)*ようこそ!$H$6+VLOOKUP($E4,$E:$K,ランキング!$K$1,0)*ようこそ!$H$7","v":331.7},{"$f":"_xlfn.PERCENTRANK.INC($P$4:$P$96,P4)*100","v":100}]
[{"$f":"A4+1","v":2},"外環道","外環浦和","JR京浜東北線","南浦和",46.8,68.5,92.4,89.2,66.400000000000006,80,{"$f":"VLOOKUP($E5,$E:$K,ようこそ!$D$4,0)","v":46.8},{"$f":"VLOOKUP($E5,$E:$K,ランキング!$H$1,0)","v":92.4},{"$f":"VLOOKUP($E5,$E:$K,ようこそ!$D$5,0)","v":89.2},{"$f":"VLOOKUP($E5,$E:$K,ランキング!$K$1,0)","v":80},{"$f":"VLOOKUP($E5,$E:$K,ようこそ!$D$4,0)*ようこそ!$H$4+VLOOKUP($E5,$E:$K,ランキング!$H$1,0)*ようこそ!$H$5+VLOOKUP($E5,$E:$K,ようこそ!$D$5,0)*ようこそ!$H$6+VLOOKUP($E5,$E:$K,ランキング!$K$1,0)*ようこそ!$H$7","v":308.39999999999998},{"$f":"_xlfn.PERCENTRANK.INC($P$4:$P$96,P5)*100","v":98.9}]
[{"$f":"A5+1","v":3},"外環道","松戸","北総線","北国分",40.300000000000004,13.099999999999994,84.8,96.8,87,80,{"$f":"VLOOKUP($E6,$E:$K,ようこそ!$D$4,0)","v":40.300000000000004},{"$f":"VLOOKUP($E6,$E:$K,ランキング!$H$1,0)","v":84.8},{"$f":"VLOOKUP($E6,$E:$K,ようこそ!$D$5,0)","v":96.8},{"$f":"VLOOKUP($E6,$E:$K,ランキング!$K$1,0)","v":80},{"$f":"VLOOKUP($E6,$E:$K,ようこそ!$D$4,0)*ようこそ!$H$4+VLOOKUP($E6,$E:$K,ランキング!$H$1,0)*ようこそ!$H$5+VLOOKUP($E6,$E:$K,ようこそ!$D$5,0)*ようこそ!$H$6+VLOOKUP($E6,$E:$K,ランキング!$K$1,0)*ようこそ!$H$7","v":301.89999999999998},{"$f":"_xlfn.PERCENTRANK.INC($P$4:$P$96,P6)*100","v":97.8}]
[{"$f":"A6+1","v":4},"東関東自動車道","湾岸千葉IC","JR京葉線","海浜幕張",37,1.0999999999999943,92.4,71.800000000000011,71.800000000000011,100,{"$f":"VLOOKUP($E7,$E:$K,ようこそ!$D$4,0)","v":37},{"$f":"VLOOKUP($E7,$E:$K,ランキング!$H$1,0)","v":92.4},{"$f":"VLOOKUP($E7,$E:$K,ようこそ!$D$5,0)","v":71.800000000000011},{"$f":"VLOOKUP($E7,$E:$K,ランキング!$K$1,0)","v":100},{"$f":"VLOOKUP($E7,$E:$K,ようこそ!$D$4,0)*ようこそ!$H$4+VLOOKUP($E7,$E:$K,ランキング!$H$1,0)*ようこそ!$H$5+VLOOKUP($E7,$E:$K,ようこそ!$D$5,0)*ようこそ!$H$6+VLOOKUP($E7,$E:$K,ランキング!$K$1,0)*ようこそ!$H$7","v":301.20000000000005},{"$f":"_xlfn.PERCENTRANK.INC($P$4:$P$96,P7)*100","v":96.7}]
[{"$f":"A7+1","v":5},"首都高6号三郷線","八潮","つくばエクスプレス","八潮",53.3,31.599999999999994,92.4,42.400000000000006,62,100,{"$f":"VLOOKUP($E8,$E:$K,ようこそ!$D$4,0)","v":53.3},{"$f":"VLOOKUP($E8,$E:$K,ランキング!$H$1,0)","v":92.4},{"$f":"VLOOKUP($E8,$E:$K,ようこそ!$D$5,0)","v":42.400000000000006},{"$f":"VLOOKUP($E8,$E:$K,ランキング!$K$1,0)","v":100},{"$f":"VLOOKUP($E8,$E:$K,ようこそ!$D$4,0)*ようこそ!$H$4+VLOOKUP($E8,$E:$K,ランキング!$H$1,0)*ようこそ!$H$5+VLOOKUP($E8,$E:$K,ようこそ!$D$5,0)*ようこそ!$H$6+VLOOKUP($E8,$E:$K,ランキング!$K$1,0)*ようこそ!$H$7","v":288.10000000000002},{"$f":"_xlfn.PERCENTRANK.INC($P$4:$P$96,P8)*100","v":95.6}]
[{"$f":"A8+1","v":6},"東関東自動車道","谷津船橋IC","JR京葉線","南船橋",55.5,9.7999999999999972,42.400000000000006,88.1,80.5,100,{"$f":"VLOOKUP($E9,$E:$K,ようこそ!$D$4,0)","v":55.5},{"$f":"VLOOKUP($E9,$E:$K,ランキング!$H$1,0)","v":42.400000000000006},{"$f":"VLOOKUP($E9,$E:$K,ようこそ!$D$5,0)","v":88.1},{"$f":"VLOOKUP($E9,$E:$K,ランキング!$K$1,0)","v":100},{"$f":"VLOOKUP($E9,$E:$K,ようこそ!$D$4,0)*ようこそ!$H$4+VLOOKUP($E9,$E:$K,ランキング!$H$1,0)*ようこそ!$H$5+VLOOKUP($E9,$E:$K,ようこそ!$D$5,0)*ようこそ!$H$6+VLOOKUP($E9,$E:$K,ランキング!$K$1,0)*ようこそ!$H$7","v":286},{"$f":"_xlfn.PERCENTRANK.INC($P$4:$P$96,P9)*100","v":94.5}]
[{"$f":"A9+1","v":7},"首都高6号向島線","駒形","都営浅草線","本所吾妻橋",96.8,72.900000000000006,74,10.900000000000006,18.5,100,{"$f":"VLOOKUP($E10,$E:$K,ようこそ!$D$4,0)","v":96.8},{"$f":"VLOOKUP($E10,$E:$K,ランキング!$H$1,0)","v":74},{"$f":"VLOOKUP($E10,$E:$K,ようこそ!$D$5,0)","v":10.900000000000006},{"$f":"VLOOKUP($E10,$E:$K,ランキング!$K$1,0)","v":100},{"$f":"VLOOKUP($E10,$E:$K,ようこそ!$D$4,0)*ようこそ!$H$4+VLOOKUP($E10,$E:$K,ランキング!$H$1,0)*ようこそ!$H$5+VLOOKUP($E10,$E:$K,ようこそ!$D$5,0)*ようこそ!$H$6+VLOOKUP($E10,$E:$K,ランキング!$K$1,0)*ようこそ!$H$7","v":281.70000000000005},{"$f":"_xlfn.PERCENTRANK.INC($P$4:$P$96,P10)*100","v":93.4}]
{"$rows_left_out":87}
{"sheet":"所要時間","index":2,"n_rows":96,"n_cols":21,"rows_kept":96,"cut":false,"hidden":false,"merged":[[1,19,1,20],[1,5,1,7],[1,8,1,10],[1,11,1,13],[1,14,1,16],[1,17,1,18]]}
[]
[null,null,null,null,null,"東京駅周辺到着",null,null,"新宿駅周辺到着",null,null,"東京駅周辺到着所要時間",null,null,"新宿駅周辺到着所要時間",null,null,"平均所要時間（分）",null,"所要時間点数"]
[0,"道路名","IC名","鉄道路線","駅名","8時着","8時半着","9時着","8時着","8時半着","9時着","8時着","8時半着","9時着","8時着","8時半着","9時着","東京","新宿","東京","新宿"]
[{"$f":"A3+1","v":1},"首都高中央環状線","中野長者橋","メトロ丸ノ内線","中野坂上","07:37:00","08:07:00","08:35:00","07:56:00","08:26:00","08:55:00",22.999999999999918,23,24.999999999999993,3.9999999999999858,3.9999999999999858,5.0000000000000622,23.666666666666639,4.3333333333333446,83.7,100]
[2,"首都高4号新宿線","幡ヶ谷","京王新線","幡ヶ谷","07:31:00","08:05:00","08:34:00","07:53:00","08:23:00","08:55:00",28.999999999999979,24.999999999999993,25.999999999999986,6.9999999999999751,7.0000000000000551,5.0000000000000622,26.666666666666654,6.3333333333333641,77.2,99]
[3,"首都高4号新宿線","永福","京王線","下高井戸","07:20:00","07:53:00","08:18:00","07:46:00","08:11:00","08:47:00",40.000000000000014,37.000000000000028,41.999999999999929,13.99999999999995,19.000000000000014,13.000000000000034,39.666666666666657,15.333333333333334,44.599999999999994,97.9]
[4,"首都高5号池袋線","北池袋","メトロ有楽町線","要町","07:32:00","08:06:00","08:33:00","07:45:00","08:13:00","08:42:00",27.999999999999979,24.000000000000075,26.999999999999986,14.999999999999947,17.000000000000021,18.000000000000014,26.333333333333346,16.666666666666661,79.400000000000006,96.8]
[5,"首都高3号渋谷線","池尻","東急田園都市線","池尻大橋","07:34:00","08:08:00","08:36:00","07:41:00","08:08:00","08:36:00",25.999999999999986,22.000000000000082,23.999999999999993,18.999999999999932,22.000000000000082,23.999999999999993,24.000000000000018,21.666666666666668,81.599999999999994,95.7]
[6,"首都高4号新宿線","高井戸","京王線","八幡山","07:15:00","07:46:00","08:12:00","07:40:00","08:05:00","08:39:00",45,44,48.000000000000071,19.999999999999929,24.999999999999993,21.000000000000007,45.666666666666686,21.999999999999975,28.299999999999997,94.6]
[7,"首都高3号渋谷線","三軒茶屋","東急田園都市線","三軒茶屋","07:32:00","08:06:00","08:33:00","07:39:00","08:06:00","08:33:00",27.999999999999979,24.000000000000075,26.999999999999986,20.999999999999925,24.000000000000075,26.999999999999986,26.333333333333346,23.999999999999996,79.400000000000006,93.5]
{"$rows_left_out":87}
{"sheet":"家賃相場","index":3,"n_rows":96,"n_cols":11,"rows_kept":96,"cut":false,"hidden":false,"merged":[[1,7,1,8],[1,5,1,6]]}
[]
[null,null,null,null,null,"家賃相場（万円）",null,"家賃点数",null,null,"点数"]
[0,"道路名","IC名","鉄道路線","駅名","1K","2LDK","1K","2LDK","商業施設","商業施設"]
[{"$f":"A3+1","v":1},"東京湾アクアライン","木更津金田","高速バス","木更津金田BT",4.5,6.1,{"$f":"100-_xlfn.PERCENTRANK.INC(F$4:F$96,F4)*100","v":99},{"$f":"100-_xlfn.PERCENTRANK.INC(G$4:G$96,G4)*100","v":100},"◎",{"$f":"VLOOKUP(J4,配点根拠!$G$3:$H$7,2,0)","v":100}]
[2,"東北自動車道","岩槻","東武野田線","岩槻",4.4000000000000004,6.31,100,99,"○",{"$f":"VLOOKUP(J5,配点根拠!$G$3:$H$7,2,0)","v":80}]
[3,"東京湾アクアライン","袖ケ浦","高速バス","袖ケ浦BT",5.28,6.31,90.3,99,"■",{"$f":"VLOOKUP(J6,配点根拠!$G$3:$H$7,2,0)","v":50}]
[4,"首都高川口線","新井宿","埼玉高速鉄道","新井宿",5.2,6.88,92.4,96.8,"■",{"$f":"VLOOKUP(J7,配点根拠!$G$3:$H$7,2,0)","v":50}]
[5,"外環道","松戸","北総線","矢切",5.05,7.6,94.6,95.7,"■",{"$f":"VLOOKUP(J8,配点根拠!$G$3:$H$7,2,0)","v":50}]
[6,"京葉道路","武石","JR総武線","幕張",6.04,7.97,69.599999999999994,94.6,"■",{"$f":"VLOOKUP(J9,配点根拠!$G$3:$H$7,2,0)","v":50}]
[7,"外環道","川口東","埼玉高速鉄道","戸塚安行",5.88,8.02,78.3,93.5,"△",{"$f":"VLOOKUP(J10,配点根拠!$G$3:$H$7,2,0)","v":20}]
{"$rows_left_out":87}
{"sheet":"配点根拠","index":4,"n_rows":23,"n_cols":29,"rows_kept":23,"cut":false,"hidden":false,"merged":[]}
[]
[null,"通勤の快適性点数",null,"目安",null,null,"商業施設点数",null,"目安",null,null,null,null,null,null,null,null,null,null,null,null,null,null,null,null,null,null,"傾斜配点"]
[null,"◎",0.5,"全ての列車が当駅始発等、着席が可能である",null,null,"◎",100,"大型商業施設が近隣に存在",null,null,null,null,null,null,null,null,null,null,null,null,null,null,null,null,null,null,{"$f":"AC3-1","v":1},2]
[null,"〇",0.8,"一部列車が当駅始発等、着席の機会がある",null,null,"○",80,"有名スーパーマーケット等が複数存在",null,null,null,null,null,null,null,null,null,null,null,null,null,null,null,null,null,null,{"$f":"AC4-1","v":0.89999999999999991},1.9]
[null,"他","国交省発表の混雑率データ通り","各路線の最高混雑率データをそのまま適用",null,null,"■",50,"スーパー等小規模なものが存在",null,null,null,null,null,null,null,null,null,null,null,null,null,null,null,null,null,null,0.8,1.8]
[null,null,null,null,null,null,"△",20,"スーパー以外の施設が存在",null,null,null,null,null,null,null,null,null,null,null,null,null,null,null,null,null,null,0.7,1.7]
[null,null,null,null,null,null,"×",0,"コンビニ等以外は商業施設が無い",null,null,null,null,null,null,null,null,null,null,null,null,null,null,null,null,null,null,0.60000000000000009,1.6]
[null,null,null,null,null,null,null,null,null,null,null,null,null,null,null,null,null,null,null,null,null,null,null,null,null,null,null,0.5,1.5]
[null,null,"点数算出方法",null,null,null,null,null,null,null,null,null,null,null,null,null,null,null,null,null,null,null,null,null,null,null,null,0.39999999999999991,1.4]
[null,null,"所要時間","東京駅or新宿駅までの所要時間分数の平均値を基に、短い順に百分率順位を使用",null,null,null,null,null,null,null,null,null,null,null,null,null,null,null,null,null,null,null,null,null,null,null,0.30000000000000004,1.3]
{"$rows_left_out":14}
{"sheet":"全データ","index":5,"n_rows":96,"n_cols":29,"rows_kept":96,"cut":false,"hidden":false,"merged":[[1,18,1,19],[1,25,1,26],[1,4,1,6],[1,7,1,9],[1,10,1,12],[1,13,1,15],[1,16,1,17]]}
[]
[null,null,null,null,"東京駅周辺到着",null,null,"新宿駅周辺到着",null,null,"東京駅周辺到着所要時間",null,null,"新宿駅周辺到着所要時間",null,null,"平均所要時間",null,"所要時間点数",null,null,null,null,null,null,"家賃点数",null,null,"点数"]
["道路名","IC名","鉄道路線","駅名","08:00:00","08:30:00","09:00:00","08:00:00","08:30:00","09:00:00","08:00:00","08:30:00","09:00:00","08:00:00","08:30:00","09:00:00","東京","新宿","東京","新宿","混雑率","始発あり","快適性点数","1K","2LDK","1K","2LDK","商業施設","商業施設"]
["東北自動車道","岩槻","東武野田線","岩槻","06:58:00","07:31:00","07:54:00","06:58:00","07:27:00","07:59:00",{"$f":"(K$3-E4)*24*60","v":61.999999999999943},{"$f":"(L$3-F4)*24*60","v":59.000000000000028},{"$f":"(M$3-G4)*24*60","v":66},{"$f":"(N$3-H4)*24*60","v":61.999999999999943},{"$f":"(O$3-I4)*24*60","v":63.000000000000014},{"$f":"(P$3-J4)*24*60","v":61.000000000000021},{"$f":"AVERAGE(K4:M4)","v":62.333333333333321},{"$f":"AVERAGE(N4:P4)","v":61.999999999999993},{"$f":"100-_xlfn.PERCENTRANK.INC(Q$4:Q$96,Q4)*100","v":2.2000000000000028},{"$f":"100-_xlfn.PERCENTRANK.INC(R$4:R$96,R4)*100","v":15.299999999999997},125,"×",{"$f":"100-_xlfn.PERCENTRANK.INC(U$4:U$96,U4)*100","v":79.400000000000006},4.4000000000000004,6.31,{"$f":"100-_xlfn.PERCENTRANK.INC(X$4:X$96,X4)*100","v":100},{"$f":"100-_xlfn.PERCENTRANK.INC(Y$4:Y$96,Y4)*100","v":99},"○",{"$f":"VLOOKUP(AB4,配点根拠!$G$3:$H$7,2,0)","v":80}]
["東京湾アクアライン","木更津金田","高速バス","木更津金田BT","07:17:00","07:47:00","08:14:00","06:55:00","07:25:00","07:55:00",{"$f":"(K$3-E5)*24*60","v":43.000000000000007},{"$f":"(L$3-F5)*24*60","v":43.000000000000007},{"$f":"(M$3-G5)*24*60","v":46.000000000000078},{"$f":"(N$3-H5)*24*60","v":64.999999999999929},{"$f":"(O$3-I5)*24*60","v":65.000000000000014},{"$f":"(P$3-J5)*24*60","v":65.000000000000014},{"$f":"AVERAGE(K5:M5)","v":44.000000000000028},{"$f":"AVERAGE(N5:P5)","v":64.999999999999986},{"$f":"100-_xlfn.PERCENTRANK.INC(Q$4:Q$96,Q5)*100","v":32.699999999999989},{"$f":"100-_xlfn.PERCENTRANK.INC(R$4:R$96,R5)*100","v":6.5999999999999943},50,"×",{"$f":"100-_xlfn.PERCENTRANK.INC(U$4:U$96,U5)*100","v":100},4.5,6.1,{"$f":"100-_xlfn.PERCENTRANK.INC(X$4:X$96,X5)*100","v":99},{"$f":"100-_xlfn.PERCENTRANK.INC(Y$4:Y$96,Y5)*100","v":100},"◎",{"$f":"VLOOKUP(AB5,配点根拠!$G$3:$H$7,2,0)","v":100}]
["外環道","草加","東武スカイツリーライン","獨協大学前","07:13:00","07:43:00","08:16:00","06:59:00","07:33:00","07:57:00",{"$f":"(K$3-E6)*24*60","v":46.999999999999993},{"$f":"(L$3-F6)*24*60","v":46.999999999999993},{"$f":"(M$3-G6)*24*60","v":43.999999999999922},{"$f":"(N$3-H6)*24*60","v":60.999999999999943},{"$f":"(O$3-I6)*24*60","v":57.000000000000036},{"$f":"(P$3-J6)*24*60","v":63.000000000000014},{"$f":"AVERAGE(K6:M6)","v":45.999999999999972},{"$f":"AVERAGE(N6:P6)","v":60.333333333333336},{"$f":"100-_xlfn.PERCENTRANK.INC(Q$4:Q$96,Q6)*100","v":27.200000000000003},{"$f":"100-_xlfn.PERCENTRANK.INC(R$4:R$96,R6)*100","v":18.5},150,"×",{"$f":"100-_xlfn.PERCENTRANK.INC(U$4:U$96,U6)*100","v":63.1},4.82,8.36,{"$f":"100-_xlfn.PERCENTRANK.INC(X$4:X$96,X6)*100","v":97.9},{"$f":"100-_xlfn.PERCENTRANK.INC(Y$4:Y$96,Y6)*100","v":90.3},"○",{"$f":"VLOOKUP(AB6,配点根拠!$G$3:$H$7,2,0)","v":80}]
["外環道","松戸","北総線","北国分","07:19:00","07:48:00","08:18:00","06:54:00","07:28:00","07:59:00",{"$f":"(K$3-E7)*24*60","v":41.000000000000014},{"$f":"(L$3-F7)*24*60","v":42.000000000000014},{"$f":"(M$3-G7)*24*60","v":41.999999999999929},{"$f":"(N$3-H7)*24*60","v":65.999999999999929},{"$f":"(O$3-I7)*24*60","v":62.000000000000021},{"$f":"(P$3-J7)*24*60","v":61.000000000000021},{"$f":"AVERAGE(K7:M7)","v":41.66666666666665},{"$f":"AVERAGE(N7:P7)","v":62.999999999999993},{"$f":"100-_xlfn.PERCENTRANK.INC(Q$4:Q$96,Q7)*100","v":40.300000000000004},{"$f":"100-_xlfn.PERCENTRANK.INC(R$4:R$96,R7)*100","v":13.099999999999994},91,"×",{"$f":"100-_xlfn.PERCENTRANK.INC(U$4:U$96,U7)*100","v":84.8},4.8600000000000003,8.5500000000000007,{"$f":"100-_xlfn.PERCENTRANK.INC(X$4:X$96,X7)*100","v":96.8},{"$f":"100-_xlfn.PERCENTRANK.INC(Y$4:Y$96,Y7)*100","v":87},"○",{"$f":"VLOOKUP(AB7,配点根拠!$G$3:$H$7,2,0)","v":80}]
["首都高S大宮線","浦和南","JR埼京線","南与野","07:09:00","07:43:00","08:07:00","07:23:00","07:51:00","08:28:00",{"$f":"(K$3-E8)*24*60","v":50.999999999999979},{"$f":"(L$3-F8)*24*60","v":46.999999999999993},{"$f":"(M$3-G8)*24*60","v":52.999999999999972},{"$f":"(N$3-H8)*24*60","v":36.99999999999995},{"$f":"(O$3-I8)*24*60","v":39.000000000000021},{"$f":"(P$3-J8)*24*60","v":31.999999999999964},{"$f":"AVERAGE(K8:M8)","v":50.333333333333314},{"$f":"AVERAGE(N8:P8)","v":35.999999999999979},{"$f":"100-_xlfn.PERCENTRANK.INC(Q$4:Q$96,Q8)*100","v":16.400000000000006},{"$f":"100-_xlfn.PERCENTRANK.INC(R$4:R$96,R8)*100","v":69.599999999999994},183,"×",{"$f":"100-_xlfn.PERCENTRANK.INC(U$4:U$96,U8)*100","v":19.599999999999994},4.96,8.6,{"$f":"100-_xlfn.PERCENTRANK.INC(X$4:X$96,X8)*100","v":95.7},{"$f":"100-_xlfn.PERCENTRANK.INC(Y$4:Y$96,Y8)*100","v":85.9},"■",{"$f":"VLOOKUP(AB8,配点根拠!$G$3:$H$7,2,0)","v":50}]
["外環道","松戸","北総線","矢切","07:21:00","07:50:00","08:20:00","06:59:00","07:30:00","08:01:00",{"$f":"(K$3-E9)*24*60","v":39.000000000000021},{"$f":"(L$3-F9)*24*60","v":40.000000000000014},{"$f":"(M$3-G9)*24*60","v":39.999999999999936},{"$f":"(N$3-H9)*24*60","v":60.999999999999943},{"$f":"(O$3-I9)*24*60","v":60.000000000000028},{"$f":"(P$3-J9)*24*60","v":58.99999999999995},{"$f":"AVERAGE(K9:M9)","v":39.666666666666657},{"$f":"AVERAGE(N9:P9)","v":59.999999999999972},{"$f":"100-_xlfn.PERCENTRANK.INC(Q$4:Q$96,Q9)*100","v":44.599999999999994},{"$f":"100-_xlfn.PERCENTRANK.INC(R$4:R$96,R9)*100","v":20.700000000000003},91,"×",{"$f":"100-_xlfn.PERCENTRANK.INC(U$4:U$96,U9)*100","v":84.8},5.05,7.6,{"$f":"100-_xlfn.PERCENTRANK.INC(X$4:X$96,X9)*100","v":94.6},{"$f":"100-_xlfn.PERCENTRANK.INC(Y$4:Y$96,Y9)*100","v":95.7},"■",{"$f":"VLOOKUP(AB9,配点根拠!$G$3:$H$7,2,0)","v":50}]
["中央自動車道","稲城","JR南武線","稲城長沼","07:01:00","07:31:00","07:58:00","07:18:00","07:55:00","08:16:00",{"$f":"(K$3-E10)*24*60","v":58.99999999999995},{"$f":"(L$3-F10)*24*60","v":59.000000000000028},{"$f":"(M$3-G10)*24*60","v":62.000000000000021},{"$f":"(N$3-H10)*24*60","v":42.000000000000014},{"$f":"(O$3-I10)*24*60","v":35.000000000000036},{"$f":"(P$3-J10)*24*60","v":43.999999999999922},{"$f":"AVERAGE(K10:M10)","v":60},{"$f":"AVERAGE(N10:P10)","v":40.333333333333321},{"$f":"100-_xlfn.PERCENTRANK.INC(Q$4:Q$96,Q10)*100","v":5.5},{"$f":"100-_xlfn.PERCENTRANK.INC(R$4:R$96,R10)*100","v":60.9},184,"×",{"$f":"100-_xlfn.PERCENTRANK.INC(U$4:U$96,U10)*100","v":15.299999999999997},5.07,9.5,{"$f":"100-_xlfn.PERCENTRANK.INC(X$4:X$96,X10)*100","v":93.5},{"$f":"100-_xlfn.PERCENTRANK.INC(Y$4:Y$96,Y10)*100","v":74},"△",{"$f":"VLOOKUP(AB10,配点根拠!$G$3:$H$7,2,0)","v":20}]
{"$rows_left_out":87}
{"sheet":"点数","index":6,"n_rows":96,"n_cols":14,"rows_kept":96,"cut":false,"hidden":true,"merged":[[1,7,1,8],[1,4,1,5]]}
[]
[null,null,null,null,"所要時間点数",null,null,"家賃点数",null,"点数"]
["道路名","IC名","鉄道路線","駅名","東京","新宿","快適性点数","1K","2LDK","商業施設","東京1K","東京2LDK","新宿1K","東京1K"]
["東北自動車道","岩槻","東武野田線","岩槻",2.2000000000000028,15.299999999999997,79.400000000000006,100,99,80,{"$f":"E4+$G4+H4+$J4","v":261.60000000000002},{"$f":"E4+$G4+I4+$J4","v":260.60000000000002},{"$f":"F4+$G4+H4+$J4","v":274.7},{"$f":"F4+$G4+I4+$J4","v":273.7}]
["東京湾アクアライン","木更津金田","高速バス","木更津金田BT",32.699999999999989,6.5999999999999943,100,99,100,100,{"$f":"E5+$G5+H5+$J5","v":331.7},{"$f":"E5+$G5+I5+$J5","v":332.7},{"$f":"F5+$G5+H5+$J5","v":305.60000000000002},{"$f":"F5+$G5+I5+$J5","v":306.60000000000002}]
["外環道","草加","東武スカイツリーライン","獨協大学前",27.200000000000003,18.5,63.1,97.9,90.3,80,268.20000000000005,260.60000000000002,259.5,251.89999999999998]
["外環道","松戸","北総線","北国分",40.300000000000004,13.099999999999994,84.8,96.8,87,80,301.89999999999998,292.10000000000002,274.7,264.89999999999998]
["首都高S大宮線","浦和南","JR埼京線","南与野",16.400000000000006,69.599999999999994,19.599999999999994,95.7,85.9,50,181.7,171.9,234.89999999999998,225.1]
["外環道","松戸","北総線","矢切",44.599999999999994,20.700000000000003,84.8,94.6,95.7,50,274,275.09999999999997,250.1,251.2]
["中央自動車道","稲城","JR南武線","稲城長沼",5.5,60.9,15.299999999999997,93.5,74,20,134.30000000000001,114.8,189.7,170.2]
{"$rows_left_out":87}
{"sheet":"参考順位","index":7,"n_rows":96,"n_cols":15,"rows_kept":96,"cut":false,"hidden":false,"merged":[[1,5,1,6],[1,8,1,9]]}
[]
[null,null,null,null,null,"所要時間点数",null,null,"家賃点数",null,"点数"]
[0,"道路名","IC名","鉄道路線","駅名","東京","新宿","快適性点数","1K","2LDK","商業施設","東京1K","東京2LDK","新宿1K","新宿2LDK"]
[{"$f":"A3+1","v":1},"東北自動車道","岩槻","東武野田線","岩槻",2.2000000000000028,15.299999999999997,79.400000000000006,100,99,80,261.60000000000002,260.60000000000002,274.7,273.7]
[2,"東京湾アクアライン","木更津金田","高速バス","木更津金田BT",32.699999999999989,6.5999999999999943,100,99,100,100,331.7,332.7,305.60000000000002,306.60000000000002]
[3,"外環道","草加","東武スカイツリーライン","獨協大学前",27.200000000000003,18.5,63.1,97.9,90.3,80,268.20000000000005,260.60000000000002,259.5,251.89999999999998]
[4,"外環道","松戸","北総線","北国分",40.300000000000004,13.099999999999994,84.8,96.8,87,80,301.89999999999998,292.10000000000002,274.7,264.89999999999998]
[5,"首都高S大宮線","浦和南","JR埼京線","南与野",16.400000000000006,69.599999999999994,19.599999999999994,95.7,85.9,50,181.7,171.9,234.89999999999998,225.1]
[6,"外環道","松戸","北総線","矢切",44.599999999999994,20.700000000000003,84.8,94.6,95.7,50,274,275.09999999999997,250.1,251.2]
[7,"中央自動車道","稲城","JR南武線","稲城長沼",5.5,60.9,15.299999999999997,93.5,74,20,134.30000000000001,114.8,189.7,170.2]
{"$rows_left_out":87}
{"sheet":"Sheet2","index":8,"n_rows":16,"n_cols":8,"rows_kept":16,"cut":false,"hidden":true,"merged":[]}
[]
[]
[]
["IC","施設名","接続路線名","起点から","BS","備考","所在地"]
["番号",null,null,"(km)"]
["Shuto Urban Expwy Sign B.svg 首都高速湾岸線"]
[1,null,"C3 東京外環自動車道",0,null,"東京外環道のJCT番号は「92」","千葉県","市川市"]
["1900-01-02","湾岸市川IC","国道357号",1,null,"成田方面出入口"]
["2020-02-01","谷津船橋IC","国道357号",5.5,null,"東京方面出入口",null,"習志野市"]
[null,null,"県道15号千葉船橋海浜線"]
{"$rows_left_out":6}